{"text_format":"3","workbook":"xlsx","n_sheets":4,"sheets":["Form","Blank","Sheet3","Drop-Down Selections"],"not_rendered":{"macros":1,"defined_names":20},"read":"whole","date_system":"1900"}

{"sheet":"Form","index":0,"n_rows":429,"n_cols":10,"rows_kept":429,"merged":[[0,0,0,9],[4,0,4,2],[5,0,5,2],[5,3,5,4],[5,6,5,7],[5,8,5,9],[6,0,6,2],[6,3,6,5],[6,6,6,7],[6,8,6,9],[7,0,7,2],[7,3,7,5],[7,6,7,7],[7,8,7,9],[8,0,8,2],[8,3,8,5],[8,6,8,7],[8,8,8,9],[9,0,9,2],[9,3,9,5],[9,6,9,7],[9,8,9,9],[10,0,10,2],[10,3,10,9],[11,0,11,2],[12,0,12,2],[12,5,12,9],[13,0,13,1],[13,6,13,8],[13,12,14,15],[14,0,14,1],[16,1,16,3],[16,4,16,9],[17,4,17,8],[18,0,18,2],[18,5,18,7],[19,0,20,2],[19,4,20,4],[19,5,19,7],[20,5,20,7],[20,11,20,13],[21,0,21,1],[21,5,21,7],[22,0,22,1],[22,5,22,7],[24,1,24,3],[24,4,24,9],[25,0,25,2],[25,7,25,8],[27,0,27,9],[28,5,28,7],[29,0,30,3],[29,4,30,4],[29,5,29,7],[30,5,30,7],[30,12,30,14],[31,0,31,1],[31,5,31,7],[32,0,32,1],[32,5,32,7],[34,1,34,3],[34,4,34,9],[35,0,35,9],[36,5,36,7],[37,0,37,2],[37,7,37,8],[39,0,39,3],[40,0,45,2],[49,0,49,4],[49,5,49,9],[50,2,50,4],[50,5,50,9],[51,0,51,1],[52,0,52,1],[53,3,53,9],[54,0,54,2],[54,3,54,4],[54,5,54,6],[55,0,57,2],[55,3,55,4],[55,5,55,6],[56,3,56,4],[56,5,56,6],[57,3,57,4],[57,5,57,6],[58,3,58,4],[58,5,58,6],[59,0,59,9],[60,0,71,9],[73,0,73,3],[73,5,73,7],[76,0,76,3],[76,5,76,7],[76,13,76,21],[79,0,79,3],[79,5,79,7],[82,5,82,7],[86,0,87,0],[86,13,86,21],[92,0,92,8],[97,0,97,7],[136,0,136,9],[137,0,148,9],[150,0,150,9],[151,0,151,2],[151,3,151,9],[152,0,152,2],[152,3,152,9],[153,0,153,2],[153,3,153,9],[154,0,154,2],[154,3,154,9],[155,0,155,3],[155,4,155,5],[156,0,156,5],[156,6,156,9],[158,0,158,5],[158,6,158,7],[159,0,159,2],[159,3,159,4],[160,0,160,2],[160,3,160,9],[161,0,161,7],[161,8,161,9],[162,0,162,7],[162,8,162,9],[164,0,164,9],[165,0,165,3],[166,0,166,6],[167,0,167,7],[167,8,167,9],[168,0,168,2],[168,3,168,9],[169,0,169,2],[169,3,169,9],[170,0,170,3],[170,4,170,5],[171,0,171,5],[171,6,171,9],[172,0,172,9],[173,0,173,5],[173,6,173,7],[174,0,174,2],[174,3,174,4],[174,6,174,7],[174,8,174,9],[175,0,175,7],[175,8,175,9],[176,0,176,7],[176,8,176,9],[178,0,178,9],[179,0,179,6],[180,0,180,7],[180,8,180,9],[181,0,181,3],[181,4,181,9],[182,0,182,3],[182,4,182,9],[183,0,183,3],[183,4,183,9],[184,0,184,3],[184,5,184,6],[185,0,185,5],[185,6,185,7],[186,0,186,4],[186,5,186,6],[187,0,187,4],[187,5,187,6],[188,0,188,2],[188,3,188,4],[189,0,189,2],[189,3,189,9],[190,0,190,9],[192,0,192,9],[193,0,193,3],[193,5,193,7],[193,8,193,9],[194,0,194,5],[194,6,194,9],[195,0,195,3],[195,4,195,5],[196,0,196,5],[196,6,196,9],[197,0,197,9],[198,0,198,4],[198,5,198,6],[199,0,199,2],[199,3,199,4],[200,0,200,2],[200,3,200,9],[201,0,201,3],[202,0,202,9],[203,0,203,9],[204,0,204,9],[206,0,206,9],[207,0,207,4],[207,5,207,9],[208,0,208,4],[208,5,208,9],[209,0,209,3],[209,4,209,5],[210,0,210,5],[210,6,210,9],[211,0,211,9],[212,0,212,4],[212,5,212,6],[213,0,213,2],[213,3,213,4],[214,0,214,2],[214,3,214,9],[215,0,215,9],[216,0,216,9],[217,0,217,9],[218,0,218,9],[220,0,220,9],[221,0,221,3],[222,0,222,3],[222,4,222,5],[223,0,223,5],[223,6,223,9],[224,0,224,9],[225,0,225,4],[225,5,225,6],[226,0,226,2],[226,3,226,4],[227,0,227,2],[227,3,227,9],[228,0,228,7],[228,8,228,9],[229,0,229,4],[229,5,229,9],[230,0,230,9],[231,0,231,9],[232,0,232,9],[419,0,419,9],[420,0,420,2],[420,3,420,9],[421,0,421,2],[421,3,421,9],[422,0,422,3],[422,4,422,5],[423,0,423,5],[423,6,423,9],[424,0,424,9],[425,0,425,5],[425,6,425,7],[426,0,426,2],[426,3,426,4],[426,6,426,7],[426,8,426,9],[427,0,427,7],[427,8,427,9],[428,0,428,7],[428,8,428,9],[429,0,429,3],[430,0,430,6],[431,0,431,7],[431,8,431,9]]}
[]
[]
[]
[]
["PROPOSED EFFECTIVE DATE:",{"$nulls":3},"Enter Position Nbr:",null,"NAME:",null,"EMPLID:"]
["DEPT NAME & DEPT #:",{"$nulls":5},"SCHOOL/DIVISION:"]
["EMPLOYEE TYPE:",null,null,"Select One (Drop-Down) ",null,null,"EMPLOYEE STATUS:",null,"Select One (Drop-Down) "]
["SELECT CURRENT RANK / TITLE / SHRACLASS (Drop-Down):",null,null,"Enter Current Rank/Title",null,null,"SELECT NEW RANK / TITLE / SHRACLASS (Drop-Down)",null,"Enter New Rank/Title"]
["CURRENT ASSIGNED MARKET RATE (SHRA ONLY):",null,null,"Current Assigned Market Rate",null,null,"NEW ASSIGNED MARKET RATE (SHRA ONLY)"]
["SELECT CURRENT COMPETENCY LEVEL (SHRA ONLY) (Drop-Down):",null,null,"Select Competency Level for Current Position",null,null,"SELECT NEW COMPETENCY LEVEL (SHRA ONLY) (Drop-Down)",null,"Select Competency Level for New Position"]
["REASON FOR INCREASE:",null,null,"Select One (Drop-Down)"]
["6/30 BASE SALARY (INCLUDE SHRA LSI)",null,null,{"$f":"IF(E12=\"Enter $$$\", 0,E12)","v":0},{"v":0,"d":"$0"}]
["STIPENDS/SUPPLEMENTS/TEMP ASSIGNMENTS:",null,null,{"$f":"IF(E13=\"Enter $$$\", 0,E13)","v":0},{"v":0,"d":"$0"},"Note Include long-term stipends supplements with a duration of 9-months or greater, not task-based compensation such as course overload"]
["Funding Source(s):",null,"State $$",{"$f":"IF(E14=\"Enter $$$\", 0,E14)","v":0},{"v":0,"d":"$0"},"=IF(E15<>\"Enter $$$\",ROUND(E15/D81,0),\"Enter $$$\")",{"$f":"B410","v":" "},null,null,{"$f":"D12+D13","v":0}]
[null,null,"Non-State $$:",{"$f":"IF(E15=\"Enter $$$\", 0,E15)","v":0},{"v":0,"d":"$0"}]
[null,null,"June 30th Full-Time Equivalent Rate (0.00-1.00)",null,{"v":1,"d":"1.00"}]
[null,"Source of Non-State Funds:"]
[{"$nulls":4},"Note:  Sources of Non-State Funds are usually grants, trust funds, endowments, medical faculty practice plan, etc. Do not enter account number (2-22222) here. "]
["CURRENT BASE SALARY:",null,null,{"$f":"IF(E19=\"Enter $$$\",0,E19)","v":0},{"v":0,"d":"$0"},"PERCENT INCREASE TO 6/30 SALARY ",null,null,{"$f":"IFERROR(ROUND(((D19-D12)/D12),3),\"0.00\"%)","v":{"v":0,"d":"0.00%"}}]
["CURRENT (POST 6/30) STIPENDS/ SUPPLEMENTS/TEMP ASSIGNMENTS:",{"$nulls":3},{"v":0,"d":"$0"},"AMOUNT OF INCREASE TO 6/30 SALARY  ",null,null,{"$f":"IF(D12<>\"0\",D19-D12,\"$0\")","v":{"v":0,"d":"$0"}}]
[{"$nulls":3},{"$f":"IF(E20=\"Enter $$$\", 0,E20)","v":0},null,"PERCENT INCREASE TO 6/30 STIPEND:",null,null,{"$f":"IFERROR((TRUNC(IF(D13<>0,((D21-D13)/D13),D21/D12),4)),\"0.00\"%)","v":{"v":0,"d":"0.00%"}}]
["Funding Source(s):",null,"State $$:",{"$f":"IF(E22=\"Enter $$$\", 0,E22)","v":0},{"v":0,"d":"$0"},"AMOUNT OF INCREASE TO 6/30 STIPEND:  ",null,null,{"$f":"IF(D13<>\"0\",D21-D13,\"$0\")","v":{"v":0,"d":"$0"}}]
[{"$f":"IF(E22<>\"Enter $$$\",ROUND(E22/D72,0),\"Enter $$$\")","v":{"$error":"#DIV/0!"}},null,"Non-State $$:",{"$f":"IF(E23=\"Enter $$$\", 0,E23)","v":0},{"v":0,"d":"$0"},{"$f":"B413","v":" "},{"$nulls":3},{"$f":"D19+D21","v":0}]
[null,null,"Current Full-Time Equivalent Rate (0.00-1.00)",null,{"v":1,"d":"1.00"}]
[{"$f":"IF(E23<>\"Enter $$$\",ROUND(E23/D72,0),\"Enter $$$\")","v":{"$error":"#DIV/0!"}},"Source of Non-State Funds:"]
["Competency Level Range (SHRA)",{"$nulls":6},"Market Rate (SHRA)/Reference Rate (EHRA NF) ",null," "]
["Job Family Level Range (EHRA)",{"$nulls":7},"Compa-ratio (EHRA)/Market Index (SHRA) ",{"$f":"IFERROR((SUM(E19/J26)),\"\")","v":""}]
[]
["RECOMMENDED BASE SALARY:",{"$nulls":3},{"v":0,"d":"$0"},"PERCENT INCREASE TO CURRENT SALARY:",null,null,{"$f":"IFERROR(ROUND((F34-D19)/D19,3),\"0.00\"%)","v":{"v":0,"d":"0.00%"}}]
["RECOMMENDED STIPENDS/SUPPLEMENTS/TEMP ASSIGNMENTS: (post-June 30th cumulative)",{"$nulls":3},{"v":0,"d":"$0"},"AMOUNT OF INCREASE TO CURRENT SALARY:",null,null,{"$f":"IF(D19<>\"0\",F34-D19,\"$0\")","v":{"v":0,"d":"$0"}}]
[{"$nulls":5},"PERCENT INCREASE TO CURRENT STIPEND:",null,null,{"$f":"IFERROR((TRUNC(IF(D21<>0,((G34-D21)/D21),G34/D19),4)),\"0.00\"%)","v":{"v":0,"d":"0.00%"}}]
["Funding Source(s):",null,"State $$:",{"$f":"IF(E32=\"Enter $$$\", 0,E32)","v":0},{"v":0,"d":"$0"},"AMOUNT OF INCREASE TO CURRENT STIPEND:",null,null,{"$f":"IF(D21<>\"0\",G34-D21,\"$0\")","v":{"v":0,"d":"$0"}}]
[{"$f":"IF(E32<>\"Enter $$$\",ROUND(E32/D72,0),\"Enter $$$\")","v":{"$error":"#DIV/0!"}},null,"Non-State $$:",{"$f":"IF(E33=\"Enter $$$\", 0,E33)","v":0},{"v":0,"d":"$0"},{"$f":"B416","v":" "},{"$nulls":3},{"$f":"F34+G34","v":0}]
[null,null,"Requested Full-Time Equivalent Rate (0.00-1.00)",null,{"v":1,"d":"1.00"},{"$f":"IF(E29=\"Enter $$$\",0,E29)","v":0},{"$f":"IF(E30=\"Enter $$$\",0,E30)","v":0}]
[{"$f":"IF(E33<>\"Enter $$$\",ROUND(E33/D72,0),\"Enter $$$\")","v":{"$error":"#DIV/0!"}},"Source of Non-State Funds:"]
[]
[]
["Competency Level Range (SHRA)",{"$nulls":3}," "," ",null,"Market Rate (SHRA)/Reference Rate (EHRA NF)",null,"Enter $$$ (EHRA)"]
["Job Family Level Range (EHRA)",{"$nulls":3}," "," ",null,null,"Compa-ratio (EHRA)/Market Index (SHRA) ",{"$f":"IFERROR((SUM(E29/J38)),\"\")","v":""}]
["Hiring Range (SHRA Competitive Recruitments) "]
[{"$nulls":3}," ","CUMULATIVE % INCREASE TO 6/30 TOTAL SALARY FOR FISCAL YEAR: ",{"$nulls":4},{"$f":"IFERROR((ROUND((F34-D12)/D12,3)),\"0.00\"%)","v":{"v":0,"d":"0.00%"}}]
[{"$nulls":3}," ","CUMULATIVE $$ INCREASE TO 6/30 TOTAL SALARY FOR FISCAL YEAR :",{"$nulls":4},{"$f":"F34-D12","v":{"v":0,"d":"$0"}}]
[]
[{"$nulls":4},"TOTAL % INCREASE OF STIPEND/SUPPLEMENT FOR FISCAL YEAR: ",{"$nulls":4},{"$f":"IFERROR((ROUND(IF(D13<>0,((G34-D13)/D13),G34/D19),3)),\"0.00%\")","v":"0.00%"}]
[{"$nulls":4},"TOTAL $$ AMOUNT OF STIPEND/SUPPLE. INCREASE FOR FISCAL YEAR: ",{"$nulls":4},{"$f":"(G34-D13)","v":{"v":0,"d":"$0"}}]
[]
[]
[{"$nulls":5},{"$f":"IF(J41=\"0.00%\",\"NO\",IF(J41>9.99%,\"YES\",IF(J41<9.99%, \"NO\")))","v":"NO"}]
[]
["THE RECOMMENDED SALARY INCREASE IS APPLIED TO THE (SELECT ONE):",{"$nulls":4},"Select One (Drop-Down)"]
[null,null,"REASON CODE:",null,null,{"$f":"D11","v":"Select One (Drop-Down)"}]
["Name & EMPLID:",null,{"$f":"CONCATENATE(H5,\" \",\"|\",\" \",J5)","v":" | "}]
["Effective Date",null,{"$f":"D5","v":"00:00:00"}]
[{"$nulls":3},"Please provide appropriate equity comparisons (Equity Pay Report for SHRA may be attached instead)"]
["SHRA: List all relevant comparison positions in same branch/role/competency. ",null,null,"Employee Name",null,"Position #",null,"Salary","Competency Level (SHRA)","Compa-ratio/Market Index"]
["EHRA NF: List relevant comparison positions in the same job family/level"]
[]
[]
[]
["PROVIDE ANY ADDITIONAL CONTEXT OR EXPLANATION HERE:"]
["DO NOT COMPLETE THIS SECTION UNTIL YOU HAVE SELECTED AN INCREASE TYPE ABOVE (ROW 11), WHICH WILL DETERMINE WHAT QUESTIONS APPEAR IN THIS SECTION.\n\nCAUTION: \n\nIf you go back and change the increase type in row 11, any information you have entered into the justification block will be deleted, and the questions will be replaced with new ones. "]
{"$rows_empty":11}
["APPROVALS:"]
["Department / Center Head Approval: "]
[{"$nulls":4},"(Type Name)",null,"(Type Title)",null,"Date"]
[]
["Dean/Vice Chancellor Approval: "]
[{"$nulls":4},"(Type Name)",null,"(Type Title)",null,"Date"]
[]
["Central Office Approval: "]
[{"$nulls":4},"(Type Name)",null,"(Type Title)",null,"Date"]
[]
[{"$nulls":3},"Prepared by: "]
[{"$nulls":4},"(Type Name)",null,"(Type Title)",null,"Date"]
["DEPARTMENT CERTIFICATION:"]
[null,"To be completed by originating unit:"]
[null,"By checking this box, the preparer certifies that all existing institutional policies and procedures for employment decisions have been followed (i.e. employment approvals, tenure and "]
[null,"promotion process, UNC code compliance, UNC System Office compliance, OSHR compliance and any local University procedures) "]
[]
[]
["Submission Instructions: "]
[]
["EHRA Non-Faculty Increases: Email form to the EHRA Non-Faculty HR unit at EPAnfsalaryrequest@unc.edu. For questions, contact your designated OHR Consultant."]
[]
["SHRA Competitive Hire Increases: Send form to your designated Talent Acquisition Partner."]
["All other SHRA increases: Send form to your designated OHR Classification and Compensation Consultant. For questions, contact your designated OHR Consultant."]
[]
[]
[]
[]
[]
[{"$nulls":9},"Revision Date: 5/29/20"]
{"$rows_empty":32}
[{"$f":"(IF(I10=\"Select Competency Level for Current Position\",\"Enter Max\",(INDEX(Sheet3!B2:G171,MATCH(1,(Sheet3!B2:B171=I8)*(IF(I10=\"Contributing\",Sheet3!D1,(IF(I10=\"Journey\",Sheet3!E1,(IF(I10=\"Advanced\",Sheet3!F1)))))=I10),0),(IF(I10=\"Contributing\",4,(IF(I10=\"Journey\",5,(IF(I10=\"Advanced\",6))))))))))","v":{"$error":"#N/A"}}]
[{"$f":"(IF(D10=\"Select Competency Level for Current Position\",\"Enter Max\",(INDEX(Sheet3!B2:G171,MATCH(1,(Sheet3!B2:B171=D8)*(IF(D10=\"Contributing\",Sheet3!D1,(IF(D10=\"Journey\",Sheet3!E1,(IF(D10=\"Advanced\",Sheet3!F1)))))=D10),0),(IF(D10=\"Contributing\",4,(IF(D10=\"Journey\",5,(IF(D10=\"Advanced\",6))))))))))","v":"Enter Max"},{"$f":"IF(D10=\"Temporary\",\"N/A (Temp)\",IF(D10=\"Select Competency Level for Current Position\",\" \",(INDEX(Sheet3!B2:G171,MATCH(1,(Sheet3!B2:B171=D8)*(IF(D10=\"Contributing\",Sheet3!D1,(IF(D10=\"Journey\",Sheet3!E1,(IF(D10=\"Advanced\",Sheet3!F1)))))=D10),0),2))))","v":" "},{"$f":"IF(D10=\"Temporary\",\"N/A (Temp)\",IF(D10=\"Select Competency Level for Current Position\",\" \",(IF(D10=\"Contributing\",((A136)-1),(IF(D10=\"Journey\",((A136)-1),(IF(D10=\"Advanced\",A136))))))))","v":" "},{"$f":"IF(D10=\"Temporary\",\"N/A (Temp)\",IF(D10=\"Select Competency Level for Current Position\",\"Enter $$$ (EPA)\",(INDEX(Sheet3!B2:G171,MATCH(1,(Sheet3!B2:B171=D8)*(IF(D10=\"Contributing\",Sheet3!D1,(IF(D10=\"Journey\",Sheet3!E1,(IF(D10=\"Advanced\",Sheet3!F1)))))=D10),0),(IF(D10=\"Contributing\",3,(IF(D10=\"Journey\",4,(IF(D10=\"Advanced\",5))))))))))","v":"Enter $$$ (EPA)"},{"$f":"IFERROR(IF(D10=\"Temporary\",\"N/A (Temp)\",INDEX(Sheet3!B2:G171,MATCH(1,(Sheet3!B2:B171=D8)*(IF(D10=\"Contributing\",Sheet3!D1,(IF(D10=\"Journey\",Sheet3!E1,(IF(D10=\"Advanced\",Sheet3!F1)))))=D10),0),(IF(D10=\"Contributing\",3,(IF(D10=\"Journey\",4,(IF(D10=\"Advanced\",5)))))))),\"Current Assigned Market Rate\")","v":"Current Assigned Market Rate"},{"$f":"IFERROR(IF(I10=\"Temporary\",\"N/A (Temp)\",INDEX(Sheet3!B2:G171,MATCH(1,(Sheet3!B2:B171=I8)*(IF(I10=\"Contributing\",Sheet3!D1,(IF(I10=\"Journey\",Sheet3!E1,(IF(I10=\"Advanced\",Sheet3!F1)))))=I10),0),(IF(I10=\"Contributing\",3,(IF(I10=\"Journey\",4,(IF(I10=\"Advanced\",5)))))))),\"New Assigned Market Rate\")","v":"New Assigned Market Rate"}]
["PROVIDE ANY ADDITIONAL CONTEXT OR EXPLANATION HERE:"]
["DO NOT COMPLETE THIS SECTION UNTIL YOU HAVE SELECTED AN INCREASE TYPE ABOVE (ROW 11), WHICH WILL DETERMINE WHAT QUESTIONS APPEAR IN THIS SECTION.\n\nCAUTION: \n\nIf you go back and change the increase type in row 11, any information you have entered into the justification block will be deleted, and the questions will be replaced with new ones. "]
{"$rows_empty":12}
["PROVIDE ANY ADDITIONAL CONTEXT OR EXPLANATION HERE:"]
["How many applicants were there?",null,null,"Answer here - must be a whole number"]
["How many applicants were interviewed?",null,null,"Answer here - must be a whole number"]
["What are the old duties?",null,null,"Answer here"]
["What are the new duties?",null,null,"Answer here"]
["Are there comparable positions within the work unit?",{"$nulls":3},"Select One (Drop-Down)"]
["Please discuss proposed salary placement relevant to positions listed above.",{"$nulls":5},"Answer here"]
[]
["Has this employee been granted a salary increase earlier this fiscal year?",{"$nulls":5},"Select One (Drop-Down)"]
["     If yes, in what month was it granted?",null,null,"Month (Drop-Down) "]
["     For what reason was it granted?",null,null,"Answer here"]
["Please indicate the highest degree earned by the employee and the major of study (e.g., Master’s in International Studies)?",{"$nulls":7},"Answer here"]
["Please indicate the number of years of directly-related experience to the position: (e.g., 6 months, 1 year, 6 years)?",{"$nulls":7},"Answer here"]
[]
["PROVIDE ANY ADDITIONAL CONTEXT OR EXPLANATION HERE:"]
["Is this an expansion of duties only or classification change?",{"$nulls":3},"Select One (Drop-Down)"]
["Are there other similarly situated employees in the work unit (based on role or job classification) that might have also been considered for the proposed additional duties or reclassification?",{"$nulls":6},"Select One (Drop-Down)"]
["     If yes, explain how this individual was selected for the additional duties or reclassification over the other employees:",{"$nulls":7},"Answer here"]
["What are the old duties?",null,null,"Answer here"]
["What are the new duties?",null,null,"Answer here"]
["Are there comparable positions within the work unit?",{"$nulls":3},"Select One (Drop-Down)"]
["Please discuss proposed salary placement relevant to positions listed above.",{"$nulls":5},"Answer here"]
[]
["Has this employee been granted a salary increase earlier this fiscal year?",{"$nulls":5},"Select One (Drop-Down)"]
["     If yes, in what month was it granted?",null,null,"Month (Drop-Down) ",null,null,"For what reason was it granted?",null,"Answer here"]
["Please indicate the highest degree earned by the employee and the major of study (e.g., Master’s in International Studies)?",{"$nulls":7},"Answer here"]
["Please indicate the number of years of directly-related experience to the position: (e.g., 6 months, 1 year, 6 years)?",{"$nulls":7},"Answer here"]
[]
["PROVIDE ANY ADDITIONAL CONTEXT OR EXPLANATION HERE:"]
["Are there other similarly situated employees in the work unit (based on role or job classification) that might have also been considered for the proposed additional duties or reclassification?",{"$nulls":6},"Select One (Drop-Down)"]
["     If yes, explain how this individual was selected for the additional duties or reclassification over the other employees:",{"$nulls":7},"Answer here"]
["What are the employee's current duties?",{"$nulls":3},"Answer here"]
["What new, temporary duties have been added?",{"$nulls":3},"Answer here"]
["What is the reason for the temporary assignment?",{"$nulls":3},"Answer here"]
["When will the employee's salary revert?",{"$nulls":3},"Month (Drop-Down) ","Year (Drop-Down) "]
["Is this the origination of a salary increase or the extension of a previous increase?",{"$nulls":5},"Select One (Drop-Down) "]
["     If an extension, when was the previous increase first approved?",{"$nulls":4},"Month (Drop-Down) ",null,"Year (Drop-Down) "]
["Has this employee been granted a salary increase earlier this fiscal year?",{"$nulls":4},"Select One (Drop-Down)"]
["     If yes, in what month was it granted?",null,null,"Month (Drop-Down) "]
["     For what reason was it granted?",null,null,"Answer here"]
[]
[]
["PROVIDE ANY ADDITIONAL CONTEXT OR EXPLANATION HERE:"]
["What competing salary was offered to the employee?",{"$nulls":3},"Answer here","What company/organization offered the salary?",null,null,"Answer here"]
["What unique or critical skills does the employee possess to justify his/her retention?",{"$nulls":5},"Answer here"]
["Are there comparable positions within the work unit?",{"$nulls":3},"Select One (Drop-Down)"]
["Please discuss proposed salary placement relevant to positions listed above.",{"$nulls":5},"Answer here"]
[]
["Has this employee been granted a salary increase earlier this fiscal year?",{"$nulls":4},"Select One (Drop-Down)"]
["     If yes, in what month was it granted?",null,null,"Month (Drop-Down) "]
["     For what reason was it granted?",null,null,"Answer here"]
[]
[]
[]
[]
[]
["PROVIDE ANY ADDITIONAL CONTEXT OR EXPLANATION HERE:"]
["What was the employee's former competency assessment rating?",{"$nulls":4},"Answer here"]
["What is the employee's new competency assessment rating?",{"$nulls":4},"Answer here"]
["Are there comparable positions within the work unit?",{"$nulls":3},"Select One (Drop-Down)"]
["Please discuss proposed salary placement Relevant to positions listed above.",{"$nulls":5},"Answer here"]
[]
["Has this employee been granted a salary increase earlier this fiscal year?",{"$nulls":4},"Select One (Drop-Down)"]
["     If yes, in what month was it granted?",null,null,"Month (Drop-Down) "]
["     For what reason was it granted?",null,null,"Answer here"]
[]
[]
[]
[]
[]
["PROVIDE ANY ADDITIONAL CONTEXT OR EXPLANATION HERE:"]
["For what reason is this request being made?",{"$nulls":3},"Select One (Drop-Down) "]
["Are there comparable positions within the work unit?",{"$nulls":3},"Select One (Drop-Down)"]
["Please discuss proposed salary placement relevant to positions listed above.",{"$nulls":5},"Answer here"]
[]
["Has this employee been granted a salary increase earlier this fiscal year?",{"$nulls":4},"Select One (Drop-Down)"]
["     If yes, in what month was it granted?",null,null,"Month (Drop-Down) "]
["     For what reason was it granted?",null,null,"Answer here"]
["If the reason for this request is \"Prevailing Federal Wage Rate Adjustment,\" what is the prevailing federal wage rate?",{"$nulls":7},"Answer here"]
["If \"Other\" reason selected above, why is this request being made?",{"$nulls":4},"Answer here"]
[]
[]
[]
[]
[]
["Select Current Title From Drop-Down List","Select New Title From Drop-Down List"]
["Accountant","Accountant"]
["Accounting Director","Accounting Director"]
["Accounting Manager","Accounting Manager"]
["Accounting Technician","Accounting Technician"]
["Administrative Support Associate","Administrative Support Associate"]
["Administrative Support Specialist","Administrative Support Specialist"]
["Administrative Support Supervisor","Administrative Support Supervisor"]
["Agricultural/Horticultural Specialist","Agricultural/Horticultural Specialist"]
["Aircraft Maintenance Specialist","Aircraft Maintenance Specialist"]
["Aircraft Operations Supervisor","Aircraft Operations Supervisor"]
["Aircraft Pilot","Aircraft Pilot"]
["Architect","Architect"]
["Archives and Records Professional","Archives and Records Professional"]
["Arts Production Specialist","Arts Production Specialist"]
["Audit Manager","Audit Manager"]
["Auditor","Auditor"]
["Broadcast & Emerging Media Eng Mgr","Broadcast & Emerging Media Eng Mgr"]
["Broadcast & Emerging Media Eng Spec","Broadcast & Emerging Media Eng Spec"]
["Broadcast & Emerging Media Eng Tech","Broadcast & Emerging Media Eng Tech"]
["Broadcast & Emerging Media Manager","Broadcast & Emerging Media Manager"]
["Broadcast & Emerging Media Specialist","Broadcast & Emerging Media Specialist"]
["Broadcast & Emerging Media Technician","Broadcast & Emerging Media Technician"]
["Budget Analyst","Budget Analyst"]
["Budget Manager","Budget Manager"]
["Building Environmental Services Manager","Building Environmental Services Manager"]
["Building Environmental Services Supv","Building Environmental Services Supv"]
["Building Environmental Services Tech","Building Environmental Services Tech"]
["Business And Technology Applic Analyst","Business And Technology Applic Analyst"]
["Business And Technology Applic Specl","Business And Technology Applic Specl"]
["Business And Technology Applic Tech","Business And Technology Applic Tech"]
["Business Manager","Business Manager"]
["Business Officer","Business Officer"]
["Business Services Coordinator","Business Services Coordinator"]
["Business Systems Analyst","Business Systems Analyst"]
["Business Systems Manager","Business Systems Manager"]
["Curatorial Director","Curatorial Director"]
["Curatorial Specialist","Curatorial Specialist"]
["Curatorial Technician","Curatorial Technician"]
["Dental Assistant","Dental Assistant"]
["Dental Hygienist","Dental Hygienist"]
["Dental Technician","Dental Technician"]
["Dentist","Dentist"]
["Early Childhood Development Practitioner","Early Childhood Development Practitioner"]
["Educational Consultant","Educational Consultant"]
["Electronics Specialist","Electronics Specialist"]
["Electronics Supervisor","Electronics Supervisor"]
["Energy Utilities Specialist","Energy Utilities Specialist"]
["Energy Utilities Supervisor","Energy Utilities Supervisor"]
["Energy Utilities Technician","Energy Utilities Technician"]
["Engineer (Metropolitan Rates)","Engineer (Metropolitan Rates)"]
["Engineering Assistant","Engineering Assistant"]
["Engineering Director","Engineering Director"]
["Engineering/Architectural Manager","Engineering/Architectural Manager"]
["Engineering/Architectural Supervisor (Metropolitan Rates)","Engineering/Architectural Supervisor (Metropolitan Rates)"]
["Engineering/Architectural Technician","Engineering/Architectural Technician"]
["Environmental Health And Safety Prof","Environmental Health And Safety Prof"]
["Environmental Health And Safety Tech","Environmental Health And Safety Tech"]
["Environmental Hlth & Safety Mgr/Consult","Environmental Hlth & Safety Mgr/Consult"]
["Environmental Specialist","Environmental Specialist"]
["Executive Assistant","Executive Assistant"]
["Facilities Superintendent","Facilities Superintendent"]
["Facility Maintenance Supervisor","Facility Maintenance Supervisor"]
["Facility Maintenance Tech - Bldg Trades","Facility Maintenance Tech - Bldg Trades"]
["Facility Maintenance Tech - Mech Trades","Facility Maintenance Tech - Mech Trades"]
["Facility Planner","Facility Planner"]
["Financial Analyst","Financial Analyst"]
["Financial Manager","Financial Manager"]
["Food Services Manager","Food Services Manager"]
["Food Services Supervisor","Food Services Supervisor"]
["Food Services Technician","Food Services Technician"]
["Geologist/Hydrogeologist","Geologist/Hydrogeologist"]
["Golf Professional","Golf Professional"]
["High Voltage Distribution Specialist","High Voltage Distribution Specialist"]
["High Voltage Distribution Supervisor","High Voltage Distribution Supervisor"]
["Human Resources Consultant","Human Resources Consultant"]
["Human Resources Manager","Human Resources Manager"]
["Human Resources Specialist","Human Resources Specialist"]
["Human Services Manager","Human Services Manager"]
["Human Services Practitioner","Human Services Practitioner"]
["Human Services Program Consultant","Human Services Program Consultant"]
["Human Services Program Support Tech","Human Services Program Support Tech"]
["Human Services Supervisor","Human Services Supervisor"]
["Information Technology Director","Information Technology Director"]
["Information Technology Manager","Information Technology Manager"]
["Interior Designer","Interior Designer"]
["IT Operations Analyst","IT Operations Analyst"]
["IT Operations Technician","IT Operations Technician"]
["IT Project Analyst / Manager","IT Project Analyst / Manager"]
["IT Project Program Manager","IT Project Program Manager"]
["IT Security Specialist","IT Security Specialist"]
["Laboratory Assistant","Laboratory Assistant"]
["Landscape Architect","Landscape Architect"]
["Legal Specialist","Legal Specialist"]
["Licensed Practical Nurse","Licensed Practical Nurse"]
["Medical and Health Program Consultant","Medical and Health Program Consultant"]
["Medical Diagnostic Specialist","Medical Diagnostic Specialist"]
["Medical Diagnostic Technician","Medical Diagnostic Technician"]
["Medical Lab Technologist/Specialist","Medical Lab Technologist/Specialist"]
["Medical Laboratory Supervisor","Medical Laboratory Supervisor"]
["Medical Laboratory Technician","Medical Laboratory Technician"]
["Medical Record Manager","Medical Record Manager"]
["Medical Support Technician","Medical Support Technician"]
["Medical Therapeutic Specialist","Medical Therapeutic Specialist"]
["Medical Therapy Technician/Assistant","Medical Therapy Technician/Assistant"]
["Medical/Nursing Assistant","Medical/Nursing Assistant"]
["Multi-Media Technician","Multi-Media Technician"]
["Networking Analyst","Networking Analyst"]
["Networking Specialist","Networking Specialist"]
["Networking Technician","Networking Technician"]
["Nurse Consultant","Nurse Consultant"]
["Nurse Director","Nurse Director"]
["Nurse Practitioner","Nurse Practitioner"]
["Nurse Supervisor","Nurse Supervisor"]
["Nutrition Assistant","Nutrition Assistant"]
["Nutrition Specialist","Nutrition Specialist"]
["Paralegal","Paralegal"]
["Paralegal Administrator","Paralegal Administrator"]
["Performing Artist","Performing Artist"]
["Pharmacist","Pharmacist"]
["Pharmacy Technician","Pharmacy Technician"]
["Physician Assistant","Physician Assistant"]
["Planner","Planner"]
["Print /Document Services Supervisor","Print /Document Services Supervisor"]
["Print/Document Services Technician","Print/Document Services Technician"]
["Professional Nurse","Professional Nurse"]
["Property Security Officer","Property Security Officer"]
["Property Security Supervisor","Property Security Supervisor"]
["Psychology Associate","Psychology Associate"]
["Public Communication Specialist","Public Communication Specialist"]
["Public Safety Manager (Metropolitan Rates)","Public Safety Manager (Metropolitan Rates)"]
["Public Safety Officer (Metropolitan Rates)","Public Safety Officer (Metropolitan Rates)"]
["Public Safety Supervisor (Metropolitan Rates)","Public Safety Supervisor (Metropolitan Rates)"]
["Public Safety Telecommunicator (Metropolitan Rates) ","Public Safety Telecommunicator (Metropolitan Rates) "]
["Public Safety Telecommunicator Supervisor (Metropolitan Rates) ","Public Safety Telecommunicator Supervisor (Metropolitan Rates) "]
["Purchasing Manager","Purchasing Manager"]
["Purchasing Specialist","Purchasing Specialist"]
["Research Operations Manager","Research Operations Manager"]
["Research Specialist","Research Specialist"]
["Research Technician","Research Technician"]
["Research Vessel Captain","Research Vessel Captain"]
["Social Work Practitioner","Social Work Practitioner"]
["Social Work Supervisor","Social Work Supervisor"]
["Social/clinical Research Assistant","Social/clinical Research Assistant"]
["Social/clinical Research Manager","Social/clinical Research Manager"]
["Social/clinical Research Specialist","Social/clinical Research Specialist"]
["Specialty Trades Technician","Specialty Trades Technician"]
["Student Services Specialist","Student Services Specialist"]
["Support Services Associate","Support Services Associate"]
["Support Services Supervisor","Support Services Supervisor"]
["Systems Programmer / Analyst","Systems Programmer / Analyst"]
["Systems Programmer / Specialist","Systems Programmer / Specialist"]
["Technology Support Analyst","Technology Support Analyst"]
["Technology Support Specialist","Technology Support Specialist"]
["Technology Support Technician","Technology Support Technician"]
["Training Specialist","Training Specialist"]
["Translator","Translator"]
["Transportation Supervisor","Transportation Supervisor"]
["Turf/Agricultural Program Manager","Turf/Agricultural Program Manager"]
["University Librarian","University Librarian"]
["University Library Specialist","University Library Specialist"]
["University Library Technician","University Library Technician"]
["University Program Associate","University Program Associate"]
["University Program Manager","University Program Manager"]
["University Program Specialist","University Program Specialist"]
["Utilities Plant Operator","Utilities Plant Operator"]
["Utilities Plant Supervisor","Utilities Plant Supervisor"]
["Vehicle/Equipment Operator","Vehicle/Equipment Operator"]
["Vehicle/Equipment Repair Tech Supv","Vehicle/Equipment Repair Tech Supv"]
["Vehicle/Equipment Repair Technician","Vehicle/Equipment Repair Technician"]
["Visual Arts Specialist","Visual Arts Specialist"]
["Select Current Title From Drop-Down List","Select New Title From Drop-Down List"]
["Enter Current Rank/Title","Enter New Rank/Title"]
[]
[null,{"$f":"IF(J14>0,B411,\" \")","v":" "}]
[null,{"$f":"IF(D14=0,B412,C411)","v":"PLEASE ENTER FUNDING"},{"$f":"IF(J14=D14+D15,\" \",\"CHECK FUNDING AMOUNTS\")","v":" "}]
[null,{"$f":"IF(D15=0,\"PLEASE ENTER FUNDING\",C412)","v":"PLEASE ENTER FUNDING"},{"$f":"IF(J14=D14+D15,\" \",\"CHECK FUNDING AMOUNTS\")","v":" "}]
[null,{"$f":"IF(J23>0,B414,\" \")","v":" "}]
[null,{"$f":"IF(D22=0,B415,C414)","v":"PLEASE ENTER FUNDING"},{"$f":"IF(J23=D22+D23,\" \",\"CHECK FUNDING AMOUNTS\")","v":" "}]
[null,{"$f":"IF(D23=0,\"PLEASE ENTER FUNDING\",C415)","v":"PLEASE ENTER FUNDING"},{"$f":"IF(J23=D22+D23,\" \",\"CHECK FUNDING AMOUNTS\")","v":" "}]
[null,{"$f":"IF(J33>0,B417,\" \")","v":" "}]
[null,{"$f":"IF(D32=0,B418,C417)","v":"PLEASE ENTER FUNDING"},{"$f":"IF(J33=D32+D33,\" \",\"CHECK FUNDING AMOUNTS\")","v":" "}]
[null,{"$f":"IF(D33=0,\"PLEASE ENTER FUNDING\",C418)","v":"PLEASE ENTER FUNDING"},{"$f":"IF(J33=D32+D33,\" \",\"CHECK FUNDING AMOUNTS\")","v":" "}]
[]
["PROVIDE ANY ADDITIONAL CONTEXT OR EXPLANATION HERE:"]
["What are the old duties?",null,null,"Answer here"]
["What are the new duties?",null,null,"Answer here"]
["Are there comparable positions within the work unit?",{"$nulls":3},"Select One (Drop-Down)"]
["Please discuss proposed salary placement relevant to positions listed above.",{"$nulls":5},"Answer here"]
[]
["Has this employee been granted a salary increase earlier this fiscal year?",{"$nulls":5},"Select One (Drop-Down)"]
["     If yes, in what month was it granted?",null,null,"Month (Drop-Down) ",null,null,"For what reason was it granted?",null,"Answer here"]
["Please indicate the highest degree earned by the employee and the major of study (e.g., Master’s in International Studies)?",{"$nulls":7},"Answer here"]
["Please indicate the number of years of directly-related experience to the position: (e.g., 6 months, 1 year, 6 years)?",{"$nulls":7},"Answer here"]

{"sheet":"Blank","index":1,"n_rows":0,"n_cols":0,"rows_kept":0}

{"sheet":"Sheet3","index":2,"n_rows":171,"n_cols":10,"rows_kept":171,"hidden":true}
[null,"CLASS TITLES","MIN","Contributing","Journey","Advanced","MAX"]
[5012008,"Accountant",{"v":37012,"d":"$37,012"},{"v":52821,"d":"$52,821"},{"v":64784,"d":"$64,784"},{"v":84895,"d":"$84,895"},{"v":105020,"d":"$105,020"},80000000]
[5012008,"Accounting Director",{"v":63734,"d":"$63,734"},{"v":92637,"d":"$92,637"},{"v":115806,"d":"$115,806"},{"v":126947,"d":"$126,947"},{"v":139428,"d":"$139,428"},80000000]
[5012008,"Accounting Manager",{"v":51195,"d":"$51,195"},{"v":71613,"d":"$71,613"},{"v":87177,"d":"$87,177"},{"v":105037,"d":"$105,037"},{"v":120454,"d":"$120,454"},80000000]
[5012008,"Accounting Technician",{"v":31200,"d":"$31,200"},{"v":35738,"d":"$35,738"},{"v":42559,"d":"$42,559"},{"v":50766,"d":"$50,766"},{"v":59049,"d":"$59,049"},80000000]
[7012007,"Administrative Support Associate",{"v":31200,"d":"$31,200"},{"v":31200,"d":"$31,200"},{"v":36177,"d":"$36,177"},{"v":40944,"d":"$40,944"},{"v":50656,"d":"$50,656"},80000001]
[7012007,"Administrative Support Specialist",{"v":31200,"d":"$31,200"},{"v":33800,"d":"$33,800"},{"v":40134,"d":"$40,134"},{"v":45834,"d":"$45,834"},{"v":53083,"d":"$53,083"},80000001]
[7012007,"Administrative Support Supervisor",{"v":31200,"d":"$31,200"},{"v":37521,"d":"$37,521"},{"v":45837,"d":"$45,837"},{"v":51038,"d":"$51,038"},{"v":58041,"d":"$58,041"},80000001]
[7012007,"Executive Assistant",{"v":31200,"d":"$31,200"},{"v":43595,"d":"$43,595"},{"v":53837,"d":"$53,837"},{"v":62885,"d":"$62,885"},{"v":71976,"d":"$71,976"},80000001]
[5012008,"Audit Manager",{"v":44996,"d":"$44,996"},{"v":76548,"d":"$76,548"},{"v":103635,"d":"$103,635"},{"v":112060,"d":"$112,060"},{"v":123052,"d":"$123,052"},80000002]
[5012008,"Auditor",{"v":37012,"d":"$37,012"},{"v":53372,"d":"$53,372"},{"v":65924,"d":"$65,924"},{"v":87870,"d":"$87,870"},{"v":109874,"d":"$109,874"},80000002]
[5012008,"Budget Analyst",{"v":41552,"d":"$41,552"},{"v":54991,"d":"$54,991"},{"v":64294,"d":"$64,294"},{"v":80084,"d":"$80,084"},{"v":100655,"d":"$100,655"},80000003]
[5012008,"Budget Manager",{"v":55142,"d":"$55,142"},{"v":80326,"d":"$80,326"},{"v":100266,"d":"$100,266"},{"v":107627,"d":"$107,627"},{"v":118175,"d":"$118,175"},80000003]
[5012008,"Business Manager",{"v":48920,"d":"$48,920"},{"v":72444,"d":"$72,444"},{"v":91218,"d":"$91,218"},{"v":106363,"d":"$106,363"},{"v":126372,"d":"$126,372"},80000004]
[5012008,"Business Officer",{"v":38748,"d":"$38,748"},{"v":55016,"d":"$55,016"},{"v":67337,"d":"$67,337"},{"v":88920,"d":"$88,920"},{"v":110165,"d":"$110,165"},80000004]
[6012008,"Business Services Coordinator",{"v":31888,"d":"$31,888"},{"v":40045,"d":"$40,045"},{"v":44784,"d":"$44,784"},{"v":51907,"d":"$51,907"},{"v":59049,"d":"$59,049"},80000004]
[5012008,"Financial Analyst",{"v":38519,"d":"$38,519"},{"v":54152,"d":"$54,152"},{"v":66794,"d":"$66,794"},{"v":90913,"d":"$90,913"},{"v":115077,"d":"$115,077"},80000006]
[5012008,"Financial Manager",{"v":61044,"d":"$61,044"},{"v":75522,"d":"$75,522"},{"v":92550,"d":"$92,550"},{"v":115516,"d":"$115,516"},{"v":138583,"d":"$138,583"},80000006]
[5012008,"Human Resources Consultant",{"v":39622,"d":"$39,622"},{"v":54892,"d":"$54,892"},{"v":66499,"d":"$66,499"},{"v":80531,"d":"$80,531"},{"v":94506,"d":"$94,506"},80000007]
[5012008,"Human Resources Manager",{"v":44996,"d":"$44,996"},{"v":66090,"d":"$66,090"},{"v":82785,"d":"$82,785"},{"v":92382,"d":"$92,382"},{"v":102113,"d":"$102,113"},80000007]
[5012008,"Human Resources Specialist",{"v":31200,"d":"$31,200"},{"v":41118,"d":"$41,118"},{"v":51645,"d":"$51,645"},{"v":58082,"d":"$58,082"},{"v":64530,"d":"$64,530"},80000007,null," "]
[7012007,"Legal Specialist",{"v":45842,"d":"$45,842"},{"v":59965,"d":"$59,965"},{"v":71187,"d":"$71,187"},{"v":84363,"d":"$84,363"},{"v":107498,"d":"$107,498"},80000008]
[7012007,"Paralegal",{"v":33078,"d":"$33,078"},{"v":42089,"d":"$42,089"},{"v":48723,"d":"$48,723"},{"v":55713,"d":"$55,713"},{"v":73806,"d":"$73,806"},80000008]
[7012007,"Paralegal Administrator",{"v":36286,"d":"$36,286"},{"v":45936,"d":"$45,936"},{"v":53382,"d":"$53,382"},{"v":63632,"d":"$63,632"},{"v":80972,"d":"$80,972"},80000008]
[6012008,"Planner",{"v":38519,"d":"$38,519"},{"v":55818,"d":"$55,818"},{"v":69184,"d":"$69,184"},{"v":72940,"d":"$72,940"},{"v":80223,"d":"$80,223"},80000009]
[6012008,"University Program Associate",{"v":31200,"d":"$31,200"},{"v":37203,"d":"$37,203"},{"v":44218,"d":"$44,218"},{"v":50530,"d":"$50,530"},{"v":56545,"d":"$56,545"},80000010]
[6012008,"University Program Manager",{"v":44996,"d":"$44,996"},{"v":56926,"d":"$56,926"},{"v":67337,"d":"$67,337"},{"v":90811,"d":"$90,811"},{"v":115077,"d":"$115,077"},80000010]
[6012008,"University Program Specialist",{"v":31888,"d":"$31,888"},{"v":43647,"d":"$43,647"},{"v":57762,"d":"$57,762"},{"v":68888,"d":"$68,888"},{"v":80223,"d":"$80,223"},80000010]
[7012007,"Social/Clinical Research Assistant",{"v":31200,"d":"$31,200"},{"v":39004,"d":"$39,004"},{"v":45494,"d":"$45,494"},{"v":53342,"d":"$53,342"},{"v":63349,"d":"$63,349"},80000011]
[7012007,"Social/Clinical Research Manager",{"v":44347,"d":"$44,347"},{"v":59996,"d":"$59,996"},{"v":72437,"d":"$72,437"},{"v":91983,"d":"$91,983"},{"v":112836,"d":"$112,836"},80000011]
[7012007,"Social/Clinical Research Specialist",{"v":34997,"d":"$34,997"},{"v":50145,"d":"$50,145"},{"v":59747,"d":"$59,747"},{"v":72827,"d":"$72,827"},{"v":89371,"d":"$89,371"},80000011]
[6012008,"Support Services Associate",{"v":31200,"d":"$31,200"},{"v":31418,"d":"$31,418"},{"v":36691,"d":"$36,691"},{"v":45469,"d":"$45,469"},{"v":54265,"d":"$54,265"},80000012]
[6012008,"Support Services Supervisor",{"v":31200,"d":"$31,200"},{"v":38784,"d":"$38,784"},{"v":46664,"d":"$46,664"},{"v":67148,"d":"$67,148"},{"v":87659,"d":"$87,659"},80000012]
[6012008,"Translator",{"v":31200,"d":"$31,200"},{"v":35390,"d":"$35,390"},{"v":40712,"d":"$40,712"},{"v":49971,"d":"$49,971"},{"v":59078,"d":"$59,078"},80000012]
[5012008,"Business Systems Analyst",{"v":44996,"d":"$44,996"},{"v":62706,"d":"$62,706"},{"v":76031,"d":"$76,031"},{"v":96723,"d":"$96,723"},{"v":117437,"d":"$117,437"},81000075]
[5012008,"Business Systems Manager",{"v":58391,"d":"$58,391"},{"v":80306,"d":"$80,306"},{"v":96723,"d":"$96,723"},{"v":112804,"d":"$112,804"},{"v":128968,"d":"$128,968"},81000075]
[5012008,"Purchasing Manager",{"v":46932,"d":"$46,932"},{"v":72575,"d":"$72,575"},{"v":93636,"d":"$93,636"},{"v":107088,"d":"$107,088"},{"v":120648,"d":"$120,648"},81000078]
[5012008,"Purchasing Specialist",{"v":31736,"d":"$31,736"},{"v":51486,"d":"$51,486"},{"v":67772,"d":"$67,772"},{"v":75977,"d":"$75,977"},{"v":84182,"d":"$84,182"},81000078]
[5012008,"Architect",{"v":42314,"d":"$42,314"},{"v":59209,"d":"$59,209"},{"v":71922,"d":"$71,922"},{"v":82491,"d":"$82,491"},{"v":93060,"d":"$93,060"},80000014]
[5012008,"Landscape Architect",{"v":42314,"d":"$42,314"},{"v":54541,"d":"$54,541"},{"v":62403,"d":"$62,403"},{"v":75058,"d":"$75,058"},{"v":87625,"d":"$87,625"},80000014]
[null,"Engineer (Metropolitan Rates)",{"v":43030,"d":"$43,030"},{"v":63414,"d":"$63,414"},{"v":75670,"d":"$75,670"},{"v":102879,"d":"$102,879"},{"v":120587,"d":"$120,587"}]
[5012008,"Engineering Assistant",{"v":31200,"d":"$31,200"},{"v":31948,"d":"$31,948"},{"v":37615,"d":"$37,615"},{"v":41873,"d":"$41,873"},{"v":46469,"d":"$46,469"},80000015]
[5012008,"Engineering Director",{"v":75202,"d":"$75,202"},{"v":127361,"d":"$127,361"},{"v":133623,"d":"$133,623"},{"v":154661,"d":"$154,661"},{"v":175111,"d":"$175,111"},80000015]
[5012008,"Engineering/Architectural Manager",{"v":63734,"d":"$63,734"},{"v":101747,"d":"$101,747"},{"v":111708,"d":"$111,708"},{"v":122666,"d":"$122,666"},{"v":135573,"d":"$135,573"},80000015]
[null,"Engineering/Architectural Supervisor (Metropolitan Rates)",{"v":46932,"d":"$46,932"},{"v":83961,"d":"$83,961"},{"v":96234,"d":"$96,234"},{"v":105644,"d":"$105,644"},{"v":126510,"d":"$126,510"}]
[5012008,"Engineering/Architectural Technician",{"v":31200,"d":"$31,200"},{"v":41081,"d":"$41,081"},{"v":50039,"d":"$50,039"},{"v":63453,"d":"$63,453"},{"v":76697,"d":"$76,697"},80000015]
[5012008,"Facility Planner",{"v":35648,"d":"$35,648"},{"v":51980,"d":"$51,980"},{"v":64941,"d":"$64,941"},{"v":74991,"d":"$74,991"},{"v":84588,"d":"$84,588"},80000015]
[5012008,"Geologist/Hydrogeologist",{"v":38519,"d":"$38,519"},{"v":46934,"d":"$46,934"},{"v":51414,"d":"$51,414"},{"v":71620,"d":"$71,620"},{"v":91707,"d":"$91,707"},80000015]
[6012008,"Human Services Program Consultant",{"v":38545,"d":"$38,545"},{"v":49193,"d":"$49,193"},{"v":56253,"d":"$56,253"},{"v":64911,"d":"$64,911"},{"v":73423,"d":"$73,423"},80000017]
[6012008,"Human Services Program Support Tech",{"v":31200,"d":"$31,200"},{"v":31200,"d":"$31,200"},{"v":35278,"d":"$35,278"},{"v":38261,"d":"$38,261"},{"v":41866,"d":"$41,866"},80000018]
[6012008,"Human Services Manager",{"v":43200,"d":"$43,200"},{"v":57840,"d":"$57,840"},{"v":68424,"d":"$68,424"},{"v":78368,"d":"$78,368"},{"v":86645,"d":"$86,645"},80000019]
[6012008,"Human Services Practitioner",{"v":31200,"d":"$31,200"},{"v":37523,"d":"$37,523"},{"v":42125,"d":"$42,125"},{"v":56122,"d":"$56,122"},{"v":70271,"d":"$70,271"},80000019]
[6012008,"Human Services Supervisor",{"v":35610,"d":"$35,610"},{"v":47794,"d":"$47,794"},{"v":56470,"d":"$56,470"},{"v":65164,"d":"$65,164"},{"v":73007,"d":"$73,007"},80000019]
[null,"Psychology Associate",{"v":43200,"d":"$43,200"},{"v":55039,"d":"$55,039"},{"v":62447,"d":"$62,447"},{"v":69685,"d":"$69,685"},{"v":76683,"d":"$76,683"}]
[6012008,"Social Work Practitioner",{"v":31200,"d":"$31,200"},{"v":43963,"d":"$43,963"},{"v":54840,"d":"$54,840"},{"v":67490,"d":"$67,490"},{"v":80270,"d":"$80,270"},80000021]
[6012008,"Social Work Supervisor",{"v":38545,"d":"$38,545"},{"v":54892,"d":"$54,892"},{"v":67554,"d":"$67,554"},{"v":75405,"d":"$75,405"},{"v":83856,"d":"$83,856"},80000021]
[5012008,"Educational Consultant",{"v":35648,"d":"$35,648"},{"v":47681,"d":"$47,681"},{"v":59980,"d":"$59,980"},{"v":80227,"d":"$80,227"},{"v":100700,"d":"$100,700"},80000022]
[5012008,"Training Specialist",{"v":34361,"d":"$34,361"},{"v":45354,"d":"$45,354"},{"v":56592,"d":"$56,592"},{"v":72387,"d":"$72,387"},{"v":88529,"d":"$88,529"},80000022]
[6012008,"Archives and Records Professional",{"v":31200,"d":"$31,200"},{"v":42363,"d":"$42,363"},{"v":56042,"d":"$56,042"},{"v":63051,"d":"$63,051"},{"v":70279,"d":"$70,279"},80000023]
[7012007,"University Librarian",{"v":34361,"d":"$34,361"},{"v":45261,"d":"$45,261"},{"v":56042,"d":"$56,042"},{"v":65207,"d":"$65,207"},{"v":73858,"d":"$73,858"},80000023]
[7012007,"University Library Specialist",{"v":31200,"d":"$31,200"},{"v":40948,"d":"$40,948"},{"v":50651,"d":"$50,651"},{"v":58900,"d":"$58,900"},{"v":67337,"d":"$67,337"},80000023]
[7012007,"University Library Technician",{"v":31200,"d":"$31,200"},{"v":34553,"d":"$34,553"},{"v":42982,"d":"$42,982"},{"v":51969,"d":"$51,969"},{"v":60817,"d":"$60,817"},80000023]
[5012008,"Broadcast & Emerging Media Eng Mgr",{"v":40012,"d":"$40,012"},{"v":53683,"d":"$53,683"},{"v":62963,"d":"$62,963"},{"v":86687,"d":"$86,687"},{"v":110317,"d":"$110,317"},80000024]
[5012008,"Broadcast & Emerging Media Eng Spec",{"v":39228,"d":"$39,228"},{"v":50279,"d":"$50,279"},{"v":57500,"d":"$57,500"},{"v":72449,"d":"$72,449"},{"v":87883,"d":"$87,883"},80000024]
[5012008,"Broadcast & Emerging Media Eng Tech",{"v":31888,"d":"$31,888"},{"v":42354,"d":"$42,354"},{"v":49192,"d":"$49,192"},{"v":68486,"d":"$68,486"},{"v":87883,"d":"$87,883"},80000024]
[5012008,"Broadcast & Emerging Media Manager",{"v":31888,"d":"$31,888"},{"v":45483,"d":"$45,483"},{"v":55454,"d":"$55,454"},{"v":66118,"d":"$66,118"},{"v":76697,"d":"$76,697"},80000024]
[5012008,"Broadcast & Emerging Media Specialist",{"v":31200,"d":"$31,200"},{"v":40730,"d":"$40,730"},{"v":50765,"d":"$50,765"},{"v":57574,"d":"$57,574"},{"v":64426,"d":"$64,426"},80000024]
[5012008,"Broadcast & Emerging Media Technician",{"v":31200,"d":"$31,200"},{"v":33394,"d":"$33,394"},{"v":38084,"d":"$38,084"},{"v":44195,"d":"$44,195"},{"v":50080,"d":"$50,080"},80000024]
[5012008,"Multi-Media Technician",{"v":31200,"d":"$31,200"},{"v":33651,"d":"$33,651"},{"v":42476,"d":"$42,476"},{"v":48528,"d":"$48,528"},{"v":54731,"d":"$54,731"},80000024]
[null,"Curatorial Director",{"v":36521,"d":"$36,521"},{"v":49030,"d":"$49,030"},{"v":63099,"d":"$63,099"},{"v":77096,"d":"$77,096"},{"v":77096,"d":"$77,096"}]
[6012008,"Curatorial Specialist",{"v":31888,"d":"$31,888"},{"v":42912,"d":"$42,912"},{"v":55147,"d":"$55,147"},{"v":61509,"d":"$61,509"},{"v":67318,"d":"$67,318"},80000025]
[6012008,"Curatorial Technician",{"v":31200,"d":"$31,200"},{"v":33782,"d":"$33,782"},{"v":44543,"d":"$44,543"},{"v":49633,"d":"$49,633"},{"v":54265,"d":"$54,265"},80000025]
[7012007,"Public Communication Specialist",{"v":31200,"d":"$31,200"},{"v":41281,"d":"$41,281"},{"v":54985,"d":"$54,985"},{"v":69254,"d":"$69,254"},{"v":83965,"d":"$83,965"},80000026]
[7012007,"Visual Arts Specialist",{"v":31200,"d":"$31,200"},{"v":38055,"d":"$38,055"},{"v":49909,"d":"$49,909"},{"v":59465,"d":"$59,465"},{"v":69511,"d":"$69,511"},80000026]
[7012007,"Student Services Specialist",{"v":31200,"d":"$31,200"},{"v":37253,"d":"$37,253"},{"v":44628,"d":"$44,628"},{"v":64177,"d":"$64,177"},{"v":83866,"d":"$83,866"},80000027]
[6012008,"Arts Production Specialist",{"v":31200,"d":"$31,200"},{"v":33067,"d":"$33,067"},{"v":41109,"d":"$41,109"},{"v":47736,"d":"$47,736"},{"v":54265,"d":"$54,265"},81000001]
[5012008,"Interior Designer",{"v":41480,"d":"$41,480"},{"v":52336,"d":"$52,336"},{"v":60871,"d":"$60,871"},{"v":72619,"d":"$72,619"},{"v":84942,"d":"$84,942"},81000001]
[5012008,"Performing Artist",{"v":35648,"d":"$35,648"},{"v":44914,"d":"$44,914"},{"v":52614,"d":"$52,614"},{"v":59682,"d":"$59,682"},{"v":67229,"d":"$67,229"},81000001]
[6012008,"Early Childhood Development Practitioner",{"v":31200,"d":"$31,200"},{"v":31200,"d":"$31,200"},{"v":34735,"d":"$34,735"},{"v":44500,"d":"$44,500"},{"v":54265,"d":"$54,265"},81000025]
[7012007,"Business And Technology Applic Analyst",{"v":43590,"d":"$43,590"},{"v":62615,"d":"$62,615"},{"v":80761,"d":"$80,761"},{"v":96486,"d":"$96,486"},{"v":113228,"d":"$113,228"},80000030]
[7012007,"Business And Technology Applic Specl",{"v":57000,"d":"$57,000"},{"v":81719,"d":"$81,719"},{"v":104003,"d":"$104,003"},{"v":116228,"d":"$116,228"},{"v":128869,"d":"$128,869"},80000030]
[7012007,"Business And Technology Applic Tech",{"v":37230,"d":"$37,230"},{"v":49092,"d":"$49,092"},{"v":61302,"d":"$61,302"},{"v":77870,"d":"$77,870"},{"v":94753,"d":"$94,753"},80000030]
[1012013,"IT Project Analyst / Manager",{"v":51000,"d":"$51,000"},{"v":71591,"d":"$71,591"},{"v":100069,"d":"$100,069"},{"v":115739,"d":"$115,739"},{"v":130996,"d":"$130,996"},80000030]
[7012007,"Information Technology Manager",{"v":57794,"d":"$57,794"},{"v":83706,"d":"$83,706"},{"v":112257,"d":"$112,257"},{"v":123270,"d":"$123,270"},{"v":141537,"d":"$141,537"},80000033]
[1012013,"IT Project Program Manager",{"v":77000,"d":"$77,000"},{"v":98956,"d":"$98,956"},{"v":120258,"d":"$120,258"},{"v":135614,"d":"$135,614"},{"v":152474,"d":"$152,474"},80000033]
[null,"Information Technology Director",{"v":79073,"d":"$79,073"},{"v":106923,"d":"$106,923"},{"v":135217,"d":"$135,217"},{"v":159171,"d":"$159,171"},{"v":184333,"d":"$184,333"}]
[1012013,"IT Security Specialist",{"v":51000,"d":"$51,000"},{"v":71013,"d":"$71,013"},{"v":98565,"d":"$98,565"},{"v":116888,"d":"$116,888"},{"v":135087,"d":"$135,087"},80000034]
[7012007,"Networking Analyst",{"v":43600,"d":"$43,600"},{"v":62299,"d":"$62,299"},{"v":76739,"d":"$76,739"},{"v":91660,"d":"$91,660"},{"v":107371,"d":"$107,371"},80000034]
[7012007,"Networking Specialist",{"v":57000,"d":"$57,000"},{"v":77955,"d":"$77,955"},{"v":96911,"d":"$96,911"},{"v":113971,"d":"$113,971"},{"v":130996,"d":"$130,996"},80000034]
[7012007,"Networking Technician",{"v":32109,"d":"$32,109"},{"v":46590,"d":"$46,590"},{"v":57705,"d":"$57,705"},{"v":69931,"d":"$69,931"},{"v":82672,"d":"$82,672"},80000034]
[1012013,"IT Operations Analyst",{"v":44000,"d":"$44,000"},{"v":56712,"d":"$56,712"},{"v":68175,"d":"$68,175"},{"v":83365,"d":"$83,365"},{"v":98780,"d":"$98,780"},80000035]
[1012013,"IT Operations Technician",{"v":31200,"d":"$31,200"},{"v":41155,"d":"$41,155"},{"v":51691,"d":"$51,691"},{"v":64576,"d":"$64,576"},{"v":77687,"d":"$77,687"},80000035]
[1012013,"Systems Programmer / Analyst",{"v":47350,"d":"$47,350"},{"v":62112,"d":"$62,112"},{"v":76507,"d":"$76,507"},{"v":91382,"d":"$91,382"},{"v":106619,"d":"$106,619"},80000035]
[1012013,"Systems Programmer / Specialist",{"v":56000,"d":"$56,000"},{"v":77315,"d":"$77,315"},{"v":101372,"d":"$101,372"},{"v":121221,"d":"$121,221"},{"v":141735,"d":"$141,735"},80000035]
[7012007,"Technology Support Analyst",{"v":32473,"d":"$32,473"},{"v":50557,"d":"$50,557"},{"v":65084,"d":"$65,084"},{"v":76416,"d":"$76,416"},{"v":88041,"d":"$88,041"},80000036]
[7012007,"Technology Support Specialist",{"v":42593,"d":"$42,593"},{"v":60121,"d":"$60,121"},{"v":74618,"d":"$74,618"},{"v":86941,"d":"$86,941"},{"v":99854,"d":"$99,854"},80000036]
[7012007,"Technology Support Technician",{"v":31200,"d":"$31,200"},{"v":40729,"d":"$40,729"},{"v":53079,"d":"$53,079"},{"v":62250,"d":"$62,250"},{"v":71944,"d":"$71,944"},80000036]
[7012007,"Building Environmental Services Manager",{"v":32865,"d":"$32,865"},{"v":43764,"d":"$43,764"},{"v":50008,"d":"$50,008"},{"v":61019,"d":"$61,019"},{"v":88384,"d":"$88,384"},80000037]
[7012007,"Building Environmental Services Supv",{"v":31200,"d":"$31,200"},{"v":36177,"d":"$36,177"},{"v":40433,"d":"$40,433"},{"v":50008,"d":"$50,008"},{"v":63583,"d":"$63,583"},80000037]
[7012007,"Building Environmental Services Tech",{"v":31200,"d":"$31,200"},{"v":31200,"d":"$31,200"},{"v":31200,"d":"$31,200"},{"v":33032,"d":"$33,032"},{"v":41234,"d":"$41,234"},80000037]
[7012007,"Food Services Manager",{"v":31200,"d":"$31,200"},{"v":40966,"d":"$40,966"},{"v":50286,"d":"$50,286"},{"v":65214,"d":"$65,214"},{"v":96662,"d":"$96,662"},80000038]
[7012007,"Food Services Supervisor",{"v":31200,"d":"$31,200"},{"v":33950,"d":"$33,950"},{"v":40600,"d":"$40,600"},{"v":54256,"d":"$54,256"},{"v":60557,"d":"$60,557"},80000038]
[7012007,"Food Services Technician",{"v":31200,"d":"$31,200"},{"v":31200,"d":"$31,200"},{"v":31200,"d":"$31,200"},{"v":31488,"d":"$31,488"},{"v":38504,"d":"$38,504"},80000038]
[15839,"Public Safety Manager (Metropolitan Rates)",{"v":48629,"d":"$48,629"},{"v":69266,"d":"$69,266"},{"v":77321,"d":"$77,321"},{"v":90855,"d":"$90,855"},{"v":97976,"d":"$97,976"}]
[15831,"Public Safety Officer (Metropolitan Rates)",{"v":31383,"d":"$31,383"},{"v":44070,"d":"$44,070"},{"v":49103,"d":"$49,103"},{"v":57557,"d":"$57,557"},{"v":64409,"d":"$64,409"}]
[15835,"Public Safety Supervisor (Metropolitan Rates)",{"v":40040,"d":"$40,040"},{"v":58941,"d":"$58,941"},{"v":65758,"d":"$65,758"},{"v":77209,"d":"$77,209"},{"v":86700,"d":"$86,700"}]
[6012008,"Property Security Officer",{"v":31200,"d":"$31,200"},{"v":31200,"d":"$31,200"},{"v":34408,"d":"$34,408"},{"v":44318,"d":"$44,318"},{"v":54265,"d":"$54,265"},80000042]
[6012008,"Property Security Supervisor",{"v":31200,"d":"$31,200"},{"v":35067,"d":"$35,067"},{"v":39250,"d":"$39,250"},{"v":61521,"d":"$61,521"},{"v":83866,"d":"$83,866"},80000042]
[15826,"Public Safety Telecommunicator (Metropolitan Rates) ",{"v":31200,"d":"$31,200"},{"v":33198,"d":"$33,198"},{"v":36832,"d":"$36,832"},{"v":45923,"d":"$45,923"},{"v":50082,"d":"$50,082"}]
[15824,"Public Safety Telecommunicator Supervisor (Metropolitan Rates)",{"v":32000,"d":"$32,000"},{"v":45272,"d":"$45,272"},{"v":55195,"d":"$55,195"},{"v":70052,"d":"$70,052"},{"v":77303,"d":"$77,303"}]
[7012007,"Environmental Health And Safety Prof",{"v":33076,"d":"$33,076"},{"v":50384,"d":"$50,384"},{"v":64377,"d":"$64,377"},{"v":80561,"d":"$80,561"},{"v":96528,"d":"$96,528"},80000043]
[7012007,"Environmental Health And Safety Tech",{"v":31200,"d":"$31,200"},{"v":37033,"d":"$37,033"},{"v":45060,"d":"$45,060"},{"v":53645,"d":"$53,645"},{"v":62194,"d":"$62,194"},80000043]
[6012008,"Environmental Hlth & Safety Mgr/Consult",{"v":38519,"d":"$38,519"},{"v":59072,"d":"$59,072"},{"v":76153,"d":"$76,153"},{"v":96138,"d":"$96,138"},{"v":115408,"d":"$115,408"},80000043]
[7012007,"Dental Assistant",{"v":31200,"d":"$31,200"},{"v":31699,"d":"$31,699"},{"v":37021,"d":"$37,021"},{"v":41906,"d":"$41,906"},{"v":46472,"d":"$46,472"},80000044]
[7012007,"Dental Hygienist",{"v":37128,"d":"$37,128"},{"v":48540,"d":"$48,540"},{"v":55966,"d":"$55,966"},{"v":65118,"d":"$65,118"},{"v":73858,"d":"$73,858"},80000044]
[7012007,"Dental Technician",{"v":31200,"d":"$31,200"},{"v":34266,"d":"$34,266"},{"v":38766,"d":"$38,766"},{"v":53053,"d":"$53,053"},{"v":67337,"d":"$67,337"},80000044]
[7012007,"Dentist",{"v":78722,"d":"$78,722"},{"v":114323,"d":"$114,323"},{"v":142372,"d":"$142,372"},{"v":164809,"d":"$164,809"},{"v":186880,"d":"$186,880"},80000044]
[7012007,"Nutrition Assistant",{"v":31200,"d":"$31,200"},{"v":31200,"d":"$31,200"},{"v":31200,"d":"$31,200"},{"v":37310,"d":"$37,310"},{"v":43429,"d":"$43,429"},80000045]
[7012007,"Nutrition Specialist",{"v":35712,"d":"$35,712"},{"v":46227,"d":"$46,227"},{"v":53282,"d":"$53,282"},{"v":68627,"d":"$68,627"},{"v":84182,"d":"$84,182"},80000045]
[5012008,"Medical Diagnostic Specialist",{"v":48058,"d":"$48,058"},{"v":58347,"d":"$58,347"},{"v":63969,"d":"$63,969"},{"v":73862,"d":"$73,862"},{"v":83856,"d":"$83,856"},80000048]
[5012008,"Medical Diagnostic Technician",{"v":31200,"d":"$31,200"},{"v":43873,"d":"$43,873"},{"v":57230,"d":"$57,230"},{"v":68250,"d":"$68,250"},{"v":79726,"d":"$79,726"},80000048]
[5012008,"Medical Lab Technologist/Specialist",{"v":37634,"d":"$37,634"},{"v":49596,"d":"$49,596"},{"v":57665,"d":"$57,665"},{"v":69327,"d":"$69,327"},{"v":80487,"d":"$80,487"},80000049]
[5012008,"Medical Laboratory Supervisor",{"v":44212,"d":"$44,212"},{"v":58844,"d":"$58,844"},{"v":69619,"d":"$69,619"},{"v":87841,"d":"$87,841"},{"v":105917,"d":"$105,917"},80000049]
[5012008,"Medical Laboratory Technician",{"v":31200,"d":"$31,200"},{"v":34649,"d":"$34,649"},{"v":43102,"d":"$43,102"},{"v":53755,"d":"$53,755"},{"v":64077,"d":"$64,077"},80000049]
[5012008,"Medical Record Manager",{"v":33080,"d":"$33,080"},{"v":49138,"d":"$49,138"},{"v":61360,"d":"$61,360"},{"v":67282,"d":"$67,282"},{"v":74123,"d":"$74,123"},80000050]
[5012008,"Medical Support Technician",{"v":31200,"d":"$31,200"},{"v":31697,"d":"$31,697"},{"v":34653,"d":"$34,653"},{"v":48313,"d":"$48,313"},{"v":61687,"d":"$61,687"},80000050]
[5012008,"Medical Therapeutic Specialist",{"v":35610,"d":"$35,610"},{"v":53668,"d":"$53,668"},{"v":68098,"d":"$68,098"},{"v":81950,"d":"$81,950"},{"v":95919,"d":"$95,919"},80000051]
[5012008,"Medical Therapy Technician/Assistant",{"v":31200,"d":"$31,200"},{"v":39296,"d":"$39,296"},{"v":50819,"d":"$50,819"},{"v":54714,"d":"$54,714"},{"v":60216,"d":"$60,216"},80000051]
[7012007,"Licensed Practical Nurse",{"v":31200,"d":"$31,200"},{"v":35666,"d":"$35,666"},{"v":42372,"d":"$42,372"},{"v":49615,"d":"$49,615"},{"v":56578,"d":"$56,578"},80000052]
[6012008,"Medical/Nursing Assistant",{"v":31200,"d":"$31,200"},{"v":31200,"d":"$31,200"},{"v":33104,"d":"$33,104"},{"v":42706,"d":"$42,706"},{"v":52381,"d":"$52,381"},80000052]
[7012007,"Nurse Consultant",{"v":41480,"d":"$41,480"},{"v":58187,"d":"$58,187"},{"v":71080,"d":"$71,080"},{"v":83490,"d":"$83,490"},{"v":95919,"d":"$95,919"},80000052]
[7012007,"Nurse Director",{"v":59190,"d":"$59,190"},{"v":90829,"d":"$90,829"},{"v":116552,"d":"$116,552"},{"v":127995,"d":"$127,995"},{"v":139063,"d":"$139,063"},80000052]
[7012007,"Nurse Practitioner",{"v":55850,"d":"$55,850"},{"v":77348,"d":"$77,348"},{"v":93142,"d":"$93,142"},{"v":106794,"d":"$106,794"},{"v":120588,"d":"$120,588"},80000052]
[7012007,"Nurse Supervisor",{"v":54231,"d":"$54,231"},{"v":71149,"d":"$71,149"},{"v":82883,"d":"$82,883"},{"v":92572,"d":"$92,572"},{"v":102983,"d":"$102,983"},80000052]
[7012007,"Professional Nurse",{"v":39152,"d":"$39,152"},{"v":52602,"d":"$52,602"},{"v":61687,"d":"$61,687"},{"v":75384,"d":"$75,384"},{"v":89072,"d":"$89,072"},80000052]
[5012008,"Pharmacist",{"v":45022,"d":"$45,022"},{"v":80363,"d":"$80,363"},{"v":110873,"d":"$110,873"},{"v":123922,"d":"$123,922"},{"v":137976,"d":"$137,976"},80000053]
[5012008,"Pharmacy Technician",{"v":31200,"d":"$31,200"},{"v":31695,"d":"$31,695"},{"v":37017,"d":"$37,017"},{"v":48877,"d":"$48,877"},{"v":60925,"d":"$60,925"},80000053]
[7012007,"Physician Assistant",{"v":59494,"d":"$59,494"},{"v":77639,"d":"$77,639"},{"v":90475,"d":"$90,475"},{"v":105493,"d":"$105,493"},{"v":120588,"d":"$120,588"},80000054]
[6012008,"Medical and Health Program Consultant",{"v":31200,"d":"$31,200"},{"v":35931,"d":"$35,931"},{"v":38973,"d":"$38,973"},{"v":50394,"d":"$50,394"},{"v":61469,"d":"$61,469"},81000027]
[6012008,"Agricultural/Horticultural Specialist",{"v":31200,"d":"$31,200"},{"v":31200,"d":"$31,200"},{"v":34484,"d":"$34,484"},{"v":44514,"d":"$44,514"},{"v":54265,"d":"$54,265"},80000056]
[6012008,"Turf/Agricultural Program Manager",{"v":31200,"d":"$31,200"},{"v":43717,"d":"$43,717"},{"v":55363,"d":"$55,363"},{"v":66540,"d":"$66,540"},{"v":78097,"d":"$78,097"},80000056]
[6012008,"Environmental Specialist",{"v":31200,"d":"$31,200"},{"v":43110,"d":"$43,110"},{"v":53355,"d":"$53,355"},{"v":60527,"d":"$60,527"},{"v":67318,"d":"$67,318"},80000059]
[7012007,"Research Operations Manager",{"v":43082,"d":"$43,082"},{"v":55055,"d":"$55,055"},{"v":62995,"d":"$62,995"},{"v":78210,"d":"$78,210"},{"v":100270,"d":"$100,270"},80000063]
[7012007,"Research Specialist",{"v":36363,"d":"$36,363"},{"v":48153,"d":"$48,153"},{"v":55055,"d":"$55,055"},{"v":68287,"d":"$68,287"},{"v":87527,"d":"$87,527"},80000063]
[7012007,"Research Technician",{"v":31200,"d":"$31,200"},{"v":34876,"d":"$34,876"},{"v":39788,"d":"$39,788"},{"v":49203,"d":"$49,203"},{"v":66122,"d":"$66,122"},80000063]
[6012008,"Research Vessel Captain",{"v":31888,"d":"$31,888"},{"v":46403,"d":"$46,403"},{"v":57471,"d":"$57,471"},{"v":65219,"d":"$65,219"},{"v":72940,"d":"$72,940"},80000064]
[6012008,"Laboratory Assistant",{"v":31200,"d":"$31,200"},{"v":32634,"d":"$32,634"},{"v":39040,"d":"$39,040"},{"v":43467,"d":"$43,467"},{"v":48252,"d":"$48,252"},81000032]
[5012008,"Aircraft Maintenance Specialist",{"v":38125,"d":"$38,125"},{"v":47280,"d":"$47,280"},{"v":52516,"d":"$52,516"},{"v":63903,"d":"$63,903"},{"v":75345,"d":"$75,345"},80000066]
[5012008,"Aircraft Operations Supervisor",{"v":46942,"d":"$46,942"},{"v":57852,"d":"$57,852"},{"v":64204,"d":"$64,204"},{"v":75129,"d":"$75,129"},{"v":86113,"d":"$86,113"},80000066]
[5012008,"Aircraft Pilot",{"v":42765,"d":"$42,765"},{"v":52786,"d":"$52,786"},{"v":58562,"d":"$58,562"},{"v":70581,"d":"$70,581"},{"v":82654,"d":"$82,654"},80000066]
[5012008,"Electronics Specialist",{"v":31888,"d":"$31,888"},{"v":42354,"d":"$42,354"},{"v":49192,"d":"$49,192"},{"v":62839,"d":"$62,839"},{"v":76697,"d":"$76,697"},80000069]
[5012008,"Electronics Supervisor",{"v":43187,"d":"$43,187"},{"v":58248,"d":"$58,248"},{"v":68909,"d":"$68,909"},{"v":76255,"d":"$76,255"},{"v":83866,"d":"$83,866"},80000069]
[6012008,"Facilities Superintendent",{"v":41552,"d":"$41,552"},{"v":55450,"d":"$55,450"},{"v":65580,"d":"$65,580"},{"v":77636,"d":"$77,636"},{"v":89464,"d":"$89,464"},80000070]
[7012007,"Facility Maintenance Supervisor",{"v":31904,"d":"$31,904"},{"v":46345,"d":"$46,345"},{"v":57311,"d":"$57,311"},{"v":72706,"d":"$72,706"},{"v":88101,"d":"$88,101"},80000070]
[7012007,"Facility Maintenance Tech - Bldg Trades",{"v":31200,"d":"$31,200"},{"v":34180,"d":"$34,180"},{"v":40815,"d":"$40,815"},{"v":49557,"d":"$49,557"},{"v":58377,"d":"$58,377"},80000070]
[7012007,"Facility Maintenance Tech - Mech Trades",{"v":31200,"d":"$31,200"},{"v":37100,"d":"$37,100"},{"v":46681,"d":"$46,681"},{"v":56392,"d":"$56,392"},{"v":66138,"d":"$66,138"},80000070]
[5012008,"Golf Professional",{"v":31200,"d":"$31,200"},{"v":37548,"d":"$37,548"},{"v":45340,"d":"$45,340"},{"v":59167,"d":"$59,167"},{"v":73415,"d":"$73,415"},80000071]
[6012008,"Print /Document Services Supervisor",{"v":31200,"d":"$31,200"},{"v":37993,"d":"$37,993"},{"v":49469,"d":"$49,469"},{"v":61303,"d":"$61,303"},{"v":73386,"d":"$73,386"},80000072]
[6012008,"Print/Document Services Technician",{"v":31200,"d":"$31,200"},{"v":31200,"d":"$31,200"},{"v":35028,"d":"$35,028"},{"v":44568,"d":"$44,568"},{"v":54265,"d":"$54,265"},80000072]
[5012008,"Specialty Trades Technician",{"v":31200,"d":"$31,200"},{"v":42496,"d":"$42,496"},{"v":52991,"d":"$52,991"},{"v":66723,"d":"$66,723"},{"v":80223,"d":"$80,223"},80000073]
[6012008,"Energy Utilities Specialist",{"v":31200,"d":"$31,200"},{"v":43953,"d":"$43,953"},{"v":53655,"d":"$53,655"},{"v":64682,"d":"$64,682"},{"v":75760,"d":"$75,760"},80000074]
[6012008,"Energy Utilities Supervisor",{"v":35474,"d":"$35,474"},{"v":51594,"d":"$51,594"},{"v":63960,"d":"$63,960"},{"v":75274,"d":"$75,274"},{"v":86707,"d":"$86,707"},80000074]
[6012008,"Energy Utilities Technician",{"v":31200,"d":"$31,200"},{"v":38960,"d":"$38,960"},{"v":45994,"d":"$45,994"},{"v":56039,"d":"$56,039"},{"v":66139,"d":"$66,139"},80000074]
[6012008,"High Voltage Distribution Specialist",{"v":33076,"d":"$33,076"},{"v":44607,"d":"$44,607"},{"v":52677,"d":"$52,677"},{"v":59753,"d":"$59,753"},{"v":67318,"d":"$67,318"},80000074]
[6012008,"High Voltage Distribution Supervisor",{"v":41552,"d":"$41,552"},{"v":54109,"d":"$54,109"},{"v":62426,"d":"$62,426"},{"v":76294,"d":"$76,294"},{"v":90754,"d":"$90,754"},80000074]
[6012008,"Utilities Plant Operator",{"v":31200,"d":"$31,200"},{"v":35865,"d":"$35,865"},{"v":43625,"d":"$43,625"},{"v":55658,"d":"$55,658"},{"v":67318,"d":"$67,318"},80000074]
[6012008,"Utilities Plant Supervisor",{"v":31200,"d":"$31,200"},{"v":40926,"d":"$40,926"},{"v":49849,"d":"$49,849"},{"v":54622,"d":"$54,622"},{"v":59872,"d":"$59,872"},80000074]
[7012007,"Transportation Supervisor",{"v":34591,"d":"$34,591"},{"v":45286,"d":"$45,286"},{"v":52319,"d":"$52,319"},{"v":63411,"d":"$63,411"},{"v":74558,"d":"$74,558"},80000075]
[8252010,"Vehicle/Equipment Operator",{"v":31200,"d":"$31,200"},{"v":32385,"d":"$32,385"},{"v":38647,"d":"$38,647"},{"v":48761,"d":"$48,761"},{"v":58935,"d":"$58,935"},80000075]
[8252010,"Vehicle/Equipment Repair Tech Supv",{"v":31200,"d":"$31,200"},{"v":43584,"d":"$43,584"},{"v":52911,"d":"$52,911"},{"v":65808,"d":"$65,808"},{"v":78748,"d":"$78,748"},80000075]
[8252010,"Vehicle/Equipment Repair Technician",{"v":31200,"d":"$31,200"},{"v":35223,"d":"$35,223"},{"v":42935,"d":"$42,935"},{"v":49055,"d":"$49,055"},{"v":61185,"d":"$61,185"},80000075]

{"sheet":"Drop-Down Selections","index":3,"n_rows":34,"n_cols":15,"rows_kept":34,"hidden":true}
["Select One (Drop-Down)",{"$nulls":7},"Select One (Drop-Down)",null,"Year (Drop-Down) ",null,null,"Select Competency Level for Current Position","Select Competency Level for New Position"]
["1a - Internal Competitive Event - Employee applies for an internally recruited job vacancy, is selected competitively, and changes jobs to a different position",{"$nulls":7},"Yes",null,2019,null,null,"Contributing","Contributing"]
["1b - External Competitive Event - Employee applies for an externally recruited job vacancy, is selected competitively, and changes jobs to a different position",{"$nulls":7},"No",null,2020,null,null,"Journey","Journey"]
["2a - Increase in job duties or responsibilities; includes reclassification of branch/role",{"$nulls":9},2021,null,null,"Advanced","Advanced"]
["2b - Temporary adjustment related to an increase in job duties or responsibilities; salary will revert when temporary duties cease",{"$nulls":7},"Month (Drop-Down) ",null,2022,null,null,"Temporary","Temporary"]
["3 - Retention",{"$nulls":7},"January",null,2023,{"$nulls":3},"Select One (Drop-Down) "]
["4a - Career progression adjustments for demonstrated employee competencies (Ex., Developing to Applied)",{"$nulls":7},"February",null,2024,{"$nulls":3},"Origination"]
["4b - Reclassification of position competency level (Ex. Journey to Advanced)",{"$nulls":7},"March",{"$nulls":5},"Extension"]
["12 - Other (must explain in comments)",{"$nulls":7},"April",null,"Year (Drop-Down) "]
[{"$nulls":8},"May",null,2020]
[{"$nulls":8},"June",null,2021,{"$nulls":3},"Select One (Drop-Down)"]
[{"$nulls":8},"July",null,2022,{"$nulls":3},"External Offer"]
[{"$nulls":8},"August",null,2023,{"$nulls":3},"Preemptive"]
[{"$nulls":8},"September",null,2024]
["Select One (Drop-Down)",{"$nulls":7},"October",null,2025]
["Base",{"$nulls":7},"November"]
["Stipend/Supplement",{"$nulls":7},"December",null,"Select One (Drop-Down) "]
["Lump Sum Payment ",{"$nulls":9},"Developing"]
["Temporary Assignment",{"$nulls":7},"Month (Drop-Down) ",null,"Applied"]
["Base and Stipend/Supplement",{"$nulls":7},"January"]
["Base and Lump Sum Payment",{"$nulls":7},"February",null,"Select One (Drop-Down) "]
["Base and Temporary Assignment",{"$nulls":7},"March",null,"Applied"]
[{"$nulls":8},"April",null,"Broadly Demonstrated"]
["Select One (Drop-Down) ",{"$nulls":7},"May"]
["Perm",{"$nulls":7},"June",null,"Select One (Drop-Down) "]
["Temp",{"$nulls":7},"July",null,"Equity Adjustment"]
["Postdoc",{"$nulls":7},"August",null,"Labor Market Adjustment"]
["Temp to Perm",{"$nulls":7},"September",null,"Prevailing Federal Wage Rate Adjustment"]
[{"$nulls":8},"October",null,"Other (Explain Below)"]
["Select One (Drop-Down) ",{"$nulls":7},"November"]
["EHRA Non-Faculty",{"$nulls":7},"December",null,"Select One (Drop-Down)"]
["SHRA",{"$nulls":9},"Expansion of Duties"]
["SHRA to EHRA",{"$nulls":9},"Reclassification"]
["EHRA to SHRA"]